error adding barc to ZonamaDev sever

Feb 19, 2017
102
0
1
43
#1
54 minutes ago
hello, i had no problem adding taanab and the barc speeder to Erusman server but when i try to add it to ZonamaDev server i get this as a error......
[772/1186] Building CXX object src/CMakeFiles/core3.dir/server/zone/managers/mission/DestroyMissionLairObserverImplementation.cpp.o
[773/1186] Building CXX object src/CMakeFiles/core3.dir/server/zone/managers/mission/spawnmaps/MissionNpcSpawnMap.cpp.o
[774/1186] Building CXX object src/CMakeFiles/core3.dir/server/zone/managers/name/NameManager.cpp.o
[775/1186] Building CXX object src/CMakeFiles/core3.dir/server/zone/managers/mission/MissionManagerImplementation.cpp.o
[776/1186] Building CXX object src/CMakeFiles/core3.dir/server/zone/managers/object/ObjectVersionUpdateManager.cpp.o
[777/1186] Building CXX object src/CMakeFiles/core3.dir/server/zone/managers/object/ObjectManager.cpp.o
FAILED: src/CMakeFiles/core3.dir/server/zone/managers/object/ObjectManager.cpp.o
ccache /usr/bin/c++ -DCOMPILE_CORE3_TESTS -DDEFAULT_DYNAMIC_CAST -DODB_REFERENCES -I/usr/local/include -I/usr/include/mysql -I/home/vagrant/workspace/Core3/MMOEngine/include -I../../../utils/googletest-release-1.8.0/googletest/include -I../../../utils/googletest-release-1.8.0/googlemock/include -I../../../src -I../../../src/autogen -I../../../utils -I../../../src/. -Wall -Wextra -Wno-unused -Wno-sign-compare -Wno-multichar -Wno-unused-parameter -Wno-overloaded-virtual -Wno-missing-declarations -Werror -march=native -fno-omit-frame-pointer -g -pthread -std=gnu++11 -MD -MT src/CMakeFiles/core3.dir/server/zone/managers/object/ObjectManager.cpp.o -MF src/CMakeFiles/core3.dir/server/zone/managers/object/ObjectManager.cpp.o.d -o src/CMakeFiles/core3.dir/server/zone/managers/object/ObjectManager.cpp.o -c /home/vagrant/workspace/Core3/MMOCoreORB/src/server/zone/managers/object/ObjectManager.cpp
/home/vagrant/workspace/Core3/MMOCoreORB/src/server/zone/managers/object/ObjectManager.cpp: In member function ‘void server::zone::managers::eek:bject::ObjectManager::deSerializeObject(engine::core::ManagedObject*, sys::io::ObjectInputStream*)’:
/home/vagrant/workspace/Core3/MMOCoreORB/src/server/zone/managers/object/ObjectManager.cpp:799:12: error: ‘class engine::core::ManagedObject’ has no member named ‘queueUpdateToDatabaseTask’; did you mean ‘updateToDatabase’?
object->queueUpdateToDatabaseTask();
^~~~~~~~~~~~~~~~~~~~~~~~~
/home/vagrant/workspace/Core3/MMOCoreORB/src/server/zone/managers/object/ObjectManager.cpp: In member function ‘server::zone::eek:bjects::scene::SceneObject* server::zone::managers::eek:bject::ObjectManager::createObject(sys::uint32, int, const sys::lang::String&, sys::uint64, bool)’:
/home/vagrant/workspace/Core3/MMOCoreORB/src/server/zone/managers/object/ObjectManager.cpp:887:11: error: ‘class server::zone::eek:bjects::scene::SceneObject’ has no member named ‘queueUpdateToDatabaseTask’; did you mean ‘updateToDatabase’?
object->queueUpdateToDatabaseTask();
^~~~~~~~~~~~~~~~~~~~~~~~~
/home/vagrant/workspace/Core3/MMOCoreORB/src/server/zone/managers/object/ObjectManager.cpp: In member function ‘engine::core::ManagedObject* server::zone::managers::eek:bject::ObjectManager::createObject(const sys::lang::String&, int, const sys::lang::String&, sys::uint64, bool)’:
/home/vagrant/workspace/Core3/MMOCoreORB/src/server/zone/managers/object/ObjectManager.cpp:925:11: error: ‘class engine::core::ManagedObject’ has no member named ‘queueUpdateToDatabaseTask’; did you mean ‘updateToDatabase’?
object->queueUpdateToDatabaseTask();
^~~~~~~~~~~~~~~~~~~~~~~~~
[778/1186] Building CXX object src/CMakeFiles/core3.dir/server/zone/managers/objectcontroller/ObjectControllerImplementation.cpp.o
[779/1186] Building CXX object src/CMakeFiles/core3.dir/server/zone/managers/objectcontroller/command/CommandConfigManager.cpp.o
[780/1186] Building CXX object src/CMakeFiles/core3.dir/server/zone/managers/objectcontroller/command/CommandConfigManager4.cpp.o
[781/1186] Building CXX object src/CMakeFiles/core3.dir/server/zone/managers/objectcontroller/command/CommandConfigManager3.cpp.o
[782/1186] Building CXX object src/CMakeFiles/core3.dir/server/zone/managers/objectcontroller/command/CommandConfigManager2.cpp.o
ninja: build stopped: subcommand failed.
Makefile:137: recipe for target 'build-ninja-debug' failed
make: *** [build-ninja-debug] Error 1
** BUILD FAILED **


WARNING: command returned error code 11

Press <ENTER> to close the window:

did i forget to do something in ZonamaDev ?